Reaction Details
TargetPoly [ADP-ribose] polymerase 1
LigandBDBM27096
Substrate/CompetitorBDBM27089
Meas. Tech.In Vitro PARP Enzyme Assay
pH8±n/a
Temperature295.15±n/a K
Ki 4±n/a nM
Citation Penning, TDZhu, GDGandhi, VBGong, JThomas, SLubisch, WGrandel, RWernet, WPark, CHFry, EHLiu, XShi, YKlinghofer, VJohnson, EFDonawho, CKFrost, DJBontcheva-Diaz, VBouska, JJOlson, AMMarsh, KCLuo, YRosenberg, SHGiranda, VL Discovery and SAR of 2-(1-propylpiperidin-4-yl)-1H-benzimidazole-4-carboxamide: A potent inhibitor of poly(ADP-ribose) polymerase (PARP) for the treatment of cancer. Bioorg Med Chem16:6965-75 (2008) 
 
Poly [ADP-ribose] polymerase 1
Name:Poly [ADP-ribose] polymerase 1
Type:n/a
Mol. Mass.:113114.22
Organism:Homo sapiens (Human)
Description:P09874
Residue:1014
BDBM27096
BDBM27089
NameBDBM27096
Synonyms:2-(pyrrolidin-3-yl)-1H-1,3-benzodiazole-4-carboxamide cyclic amine-containing benzimidazole carboxamide, 7
TypeSmall organic molecule
Emp. Form.C12H14N4O
Mol. Mass.230.2658
SMILESNC(=O)c1cccc2nc([nH]c12)C1CCNC1