Reaction Details
TargetHistone deacetylase 1
LigandBDBM27179
Substrate/CompetitorBDBM25143
Meas. Tech.HDAC Activity Assay
pH8±n/a
Temperature310.15±n/a K
IC50 13.9±n/a nM
Citation Oyelere, AKChen, PCGuerrant, WMwakwari, SCHood, RZhang, YFan, Y Non-peptide macrocyclic histone deacetylase inhibitors. J Med Chem52:456-68 (2009) 
 
Histone deacetylase 1
Name:Histone deacetylase 1
Type:Enzyme
Mol. Mass.:55090.27
Organism:Homo sapiens (Human)
Description:Q13547
Residue:482
BDBM27179
BDBM25143
NameBDBM27179
Synonyms:triazole-linked azithromycin-based compound, 16c
Typen/a
Emp. Form.C53H90N6O14
Mol. Mass.1035.3135
SMILESCC[C@H]1OC(=O)[C@H](C)[C@@H](O[C@H]2C[C@@](C)(OC)[C@@H](O)[C@H](C)O2)[C@H](C)[C@@H](O[C@@H]2O[C@H](C)C[C@@H]([C@H]2O)N(C)Cc2ccc(cc2)-c2cn(CCCCCCC(=O)NO)nn2)[C@](C)(O)C[C@@H](C)CN(C)[C@H](C)[C@@H](O)[C@]1(C)O