Reaction Details
TargetHistone deacetylase 1
LigandBDBM27180
Substrate/CompetitorBDBM25143
Meas. Tech.HDAC Activity Assay
pH8±n/a
Temperature310.15±n/a K
IC50 10.6±n/a nM
Citation Oyelere, AKChen, PCGuerrant, WMwakwari, SCHood, RZhang, YFan, Y Non-peptide macrocyclic histone deacetylase inhibitors. J Med Chem52:456-68 (2009) 
 
Histone deacetylase 1
Name:Histone deacetylase 1
Type:Enzyme
Mol. Mass.:55090.27
Organism:Homo sapiens (Human)
Description:Q13547
Residue:482
BDBM27180
BDBM25143
NameBDBM27180
Synonyms:7-{4-[4-({[(2S,3R,4S,6R)-2-{[(2R,3S,4R,5R,8R,10R,11R,12S,13S,14R)-2-ethyl-3,4,10,13-tetrahydroxy-3,5,6,8,10,12,14-heptamethyl-15-oxo-1-oxa-6-azacyclopentadecan-11-yl]oxy}-3-hydroxy-6-methyloxan-4-yl](methyl)amino}methyl)phenyl]-1H-1,2,3-triazol-1-yl}-N-hydroxyheptanamide | triazole-linked azithromycin-based compound, 16d
Typen/a
Emp. Form.C45H76N6O11
Mol. Mass.877.1185
SMILESCC[C@H]1OC(=O)[C@H](C)[C@@H](O)[C@H](C)[C@@H](O[C@@H]2O[C@H](C)C[C@@H]([C@H]2O)N(C)Cc2ccc(cc2)-c2cn(CCCCCCC(=O)NO)nn2)[C@](C)(O)C[C@@H](C)CN(C)[C@H](C)[C@@H](O)[C@]1(C)O