Reaction Details
TargetReceptor-type tyrosine-protein kinase FLT3
LigandBDBM389561
Substrate/Competitorn/a
Meas. Tech.Biochemical Activity Assay
IC50 5110±n/a nM
Citation Baska, FKéri, GOrfi, LBánhegyi, PKékesi, LZsákai, LSipos, ASzántai-kis, CDobos, JDen Blaauwen, T Styryl quinazoline derivatives as pharmaceutically active agents US Patent US9951029 Publication Date 4/24/2018
 
Receptor-type tyrosine-protein kinase FLT3
Name:Receptor-type tyrosine-protein kinase FLT3
Type:Enzyme
Mol. Mass.:112888.62
Organism:Homo sapiens (Human)
Description:P36888
Residue:993
BDBM389561
NameBDBM389561
Synonyms:N'-{2-[(E)-2-(4- methoxyphenyl)vinyl]quinazolin-4- yl}-N,N-dimethylpropane-1,3- diamine | US9951029, 12
TypeSmall organic molecule
Emp. Form.C22H26N4O
Mol. Mass.362.468
SMILESCOc1ccc(\C=C\c2nc(NCCCN(C)C)c3ccccc3n2)cc1