Reaction Details
TargetReceptor-type tyrosine-protein kinase FLT3
LigandBDBM389563
Substrate/Competitorn/a
Meas. Tech.Biochemical Activity Assay
IC50 3076±n/a nM
Citation Baska, FKéri, GOrfi, LBánhegyi, PKékesi, LZsákai, LSipos, ASzántai-kis, CDobos, JDen Blaauwen, T Styryl quinazoline derivatives as pharmaceutically active agents US Patent US9951029 Publication Date 4/24/2018
 
Receptor-type tyrosine-protein kinase FLT3
Name:Receptor-type tyrosine-protein kinase FLT3
Type:Enzyme
Mol. Mass.:112888.62
Organism:Homo sapiens (Human)
Description:P36888
Residue:993
BDBM389563
NameBDBM389563
Synonyms:N'-{2-[(E)-2-(4- fluorophenyl)vinyl]quinazolin-4-yl}- N,N-dimethylpropane-1,3-diamine | US9951029, 16
TypeSmall organic molecule
Emp. Form.C21H23FN4
Mol. Mass.350.4325
SMILESCN(C)CCCNc1nc(\C=C\c2ccc(F)cc2)nc2ccccc12