Reaction Details
TargetReceptor-type tyrosine-protein kinase FLT3
LigandBDBM389569
Substrate/Competitorn/a
Meas. Tech.Biochemical Activity Assay
IC50 4759±n/a nM
Citation Baska, FKéri, GOrfi, LBánhegyi, PKékesi, LZsákai, LSipos, ASzántai-kis, CDobos, JDen Blaauwen, T Styryl quinazoline derivatives as pharmaceutically active agents US Patent US9951029 Publication Date 4/24/2018
 
Receptor-type tyrosine-protein kinase FLT3
Name:Receptor-type tyrosine-protein kinase FLT3
Type:Enzyme
Mol. Mass.:112888.62
Organism:Homo sapiens (Human)
Description:P36888
Residue:993
BDBM389569
NameBDBM389569
Synonyms:N,N-diethyl-N'-{6-fluoro-2-[(E)-2-(4- fluorophenyl)vinyl]quinazolin-4- yl}propane-1,3-diamine | US9951029, 23
TypeSmall organic molecule
Emp. Form.C23H26F2N4
Mol. Mass.396.4761
SMILESCCN(CC)CCCNc1nc(\C=C\c2ccc(F)cc2)nc2ccc(F)cc12