Reaction Details
TargetReceptor-type tyrosine-protein kinase FLT3
LigandBDBM389582
Substrate/Competitorn/a
Meas. Tech.Biochemical Activity Assay
IC50 1641±n/a nM
Citation Baska, FKéri, GOrfi, LBánhegyi, PKékesi, LZsákai, LSipos, ASzántai-kis, CDobos, JDen Blaauwen, T Styryl quinazoline derivatives as pharmaceutically active agents US Patent US9951029 Publication Date 4/24/2018
 
Receptor-type tyrosine-protein kinase FLT3
Name:Receptor-type tyrosine-protein kinase FLT3
Type:Enzyme
Mol. Mass.:112888.62
Organism:Homo sapiens (Human)
Description:P36888
Residue:993
BDBM389582
NameBDBM389582
Synonyms:N,N-dimethyl-N'-{2-[(E)-2-(2- thienyl)vinyl]benzo[g]quinazolin-4- yl}propane-1,3-diamine | US9951029, 82
TypeSmall organic molecule
Emp. Form.C23H24N4S
Mol. Mass.388.528
SMILESCN(C)CCCNc1nc(\C=C\c2cccs2)nc2cc3ccccc3cc12