Reaction Details
TargetReceptor-type tyrosine-protein kinase FLT3
LigandBDBM389589
Substrate/Competitorn/a
Meas. Tech.Biochemical Activity Assay
IC50 2018±n/a nM
Citation Baska, FKéri, GOrfi, LBánhegyi, PKékesi, LZsákai, LSipos, ASzántai-kis, CDobos, JDen Blaauwen, T Styryl quinazoline derivatives as pharmaceutically active agents US Patent US9951029 Publication Date 4/24/2018
 
Receptor-type tyrosine-protein kinase FLT3
Name:Receptor-type tyrosine-protein kinase FLT3
Type:Enzyme
Mol. Mass.:112888.62
Organism:Homo sapiens (Human)
Description:P36888
Residue:993
BDBM389589
NameBDBM389589
Synonyms:N'-{2-[(E)-2-(4- isopropylphenyl)vinyl]quinazolin-4- yl}-N,N-dimethylpropane-1,3- diamine | US9951029, 98
TypeSmall organic molecule
Emp. Form.C24H30N4
Mol. Mass.374.5218
SMILESCC(C)c1ccc(\C=C\c2nc(NCCCN(C)C)c3ccccc3n2)cc1