Reaction Details
TargetReceptor-type tyrosine-protein kinase FLT3
LigandBDBM389606
Substrate/Competitorn/a
Meas. Tech.Biochemical Activity Assay
IC50 1271±n/a nM
Citation Baska, FKéri, GOrfi, LBánhegyi, PKékesi, LZsákai, LSipos, ASzántai-kis, CDobos, JDen Blaauwen, T Styryl quinazoline derivatives as pharmaceutically active agents US Patent US9951029 Publication Date 4/24/2018
 
Receptor-type tyrosine-protein kinase FLT3
Name:Receptor-type tyrosine-protein kinase FLT3
Type:Enzyme
Mol. Mass.:112888.62
Organism:Homo sapiens (Human)
Description:P36888
Residue:993
BDBM389606
NameBDBM389606
Synonyms:N'-{6-chloro-2-[(E)-2-(4- isopropylphenyl)vinyl]quinazolin-4- yl}-N,N-dimethylpropane-1,3- diamine | US9951029, 123
TypeSmall organic molecule
Emp. Form.C24H29ClN4
Mol. Mass.408.967
SMILESCC(C)c1ccc(\C=C\c2nc(NCCCN(C)C)c3cc(Cl)ccc3n2)cc1