Reaction Details
TargetReceptor-type tyrosine-protein kinase FLT3
LigandBDBM389614
Substrate/Competitorn/a
Meas. Tech.Biochemical Activity Assay
IC50 1982±n/a nM
Citation Baska, FKéri, GOrfi, LBánhegyi, PKékesi, LZsákai, LSipos, ASzántai-kis, CDobos, JDen Blaauwen, T Styryl quinazoline derivatives as pharmaceutically active agents US Patent US9951029 Publication Date 4/24/2018
 
Receptor-type tyrosine-protein kinase FLT3
Name:Receptor-type tyrosine-protein kinase FLT3
Type:Enzyme
Mol. Mass.:112888.62
Organism:Homo sapiens (Human)
Description:P36888
Residue:993
BDBM389614
NameBDBM389614
Synonyms:N'-(6-chloro-2-{(E)-2-[4- (methylsulfonyl)phenyl]vinyl}quinazolin- 4-yl)-N,N-diethylpropane-1,3- diamine | US9951029, 131
TypeSmall organic molecule
Emp. Form.C24H29ClN4O2S
Mol. Mass.473.031
SMILESCCN(CC)CCCNc1nc(\C=C\c2ccc(cc2)S(C)(=O)=O)nc2ccc(Cl)cc12