Reaction Details
TargetReceptor-type tyrosine-protein kinase FLT3
LigandBDBM389615
Substrate/Competitorn/a
Meas. Tech.Biochemical Activity Assay
IC50 246±n/a nM
Citation Baska, FKéri, GOrfi, LBánhegyi, PKékesi, LZsákai, LSipos, ASzántai-kis, CDobos, JDen Blaauwen, T Styryl quinazoline derivatives as pharmaceutically active agents US Patent US9951029 Publication Date 4/24/2018
 
Receptor-type tyrosine-protein kinase FLT3
Name:Receptor-type tyrosine-protein kinase FLT3
Type:Enzyme
Mol. Mass.:112888.62
Organism:Homo sapiens (Human)
Description:P36888
Residue:993
BDBM389615
NameBDBM389615
Synonyms:N'-(6-chloro-2-{(E)-2-[4- (methylsulfonyl)phenyl]vinyl}quinazolin- 4-yl)-N,N-dimethylethane-1,2- diamine | US9951029, 132
TypeSmall organic molecule
Emp. Form.C21H23ClN4O2S
Mol. Mass.430.951
SMILESCN(C)CCNc1nc(\C=C\c2ccc(cc2)S(C)(=O)=O)nc2ccc(Cl)cc12