Reaction Details
TargetReceptor-type tyrosine-protein kinase FLT3
LigandBDBM389616
Substrate/Competitorn/a
Meas. Tech.Biochemical Activity Assay
IC50 440±n/a nM
Citation Baska, FKéri, GOrfi, LBánhegyi, PKékesi, LZsákai, LSipos, ASzántai-kis, CDobos, JDen Blaauwen, T Styryl quinazoline derivatives as pharmaceutically active agents US Patent US9951029 Publication Date 4/24/2018
 
Receptor-type tyrosine-protein kinase FLT3
Name:Receptor-type tyrosine-protein kinase FLT3
Type:Enzyme
Mol. Mass.:112888.62
Organism:Homo sapiens (Human)
Description:P36888
Residue:993
BDBM389616
NameBDBM389616
Synonyms:N'-(6-chloro-2-{(E)-2-[4- (methylsulfonyl)phenyl]vinyl}quinazolin- 4-yl)-N,N-diethylethane-1,2- diamine | US9951029, 133
TypeSmall organic molecule
Emp. Form.C23H27ClN4O2S
Mol. Mass.459.004
SMILESCCN(CC)CCNc1nc(\C=C\c2ccc(cc2)S(C)(=O)=O)nc2ccc(Cl)cc12