Reaction Details
TargetHistamine H3 receptor
LigandBDBM27212
Substrate/CompetitorBDBM22530
Meas. Tech.Radioligand Binding Assay
pH7.4±n/a
Temperature298.15±n/a K
Ki 1.15±n/a nM
Citation Zhao, CSun, MBennani, YLGopalakrishnan, SMWitte, DGMiller, TRKrueger, KMBrowman, KEThiffault, CWetter, JMarsh, KCHancock, AAEsbenshade, TACowart, MD The alkaloid conessine and analogues as potent histamine H3 receptor antagonists. J Med Chem51:5423-30 (2008) 
 
Histamine H3 receptor
Name:Histamine H3 receptor
Type:G Protein-Coupled Receptor (GPCR)
Mol. Mass.:48691.47
Organism:Homo sapiens (Human)
Description:Binding assays were using CHO cells stably expressing hH3R receptors.
Residue:445
BDBM27212
BDBM22530
NameBDBM27212
Synonyms:(2S)-2-acetamido-N-methyl-3-phenyl-N-[(1R,2S,5S,6S,9R,12S,13R,16S)-6,7,13-trimethyl-7-azapentacyclo[10.8.0.0^{2,9}.0^{5,9}.0^{13,18}]icos-18-en-16-yl]propanamide | Conessine analogue, 13e
TypeSmall organic molecule
Emp. Form.C34H49N3O2
Mol. Mass.531.7718
SMILES[H][C@@]1(C)N(C)C[C@]23CC[C@@]4([H])[C@@]([H])(CC=C5C[C@H](CC[C@]45C)N(C)C(=O)[C@H](Cc4ccccc4)NC(C)=O)[C@]2([H])CC[C@]13[H]