Reaction Details
TargetcAMP-dependent protein kinase catalytic subunit alpha
LigandBDBM27225
Substrate/CompetitorBDBM27221
Meas. Tech.Fluorescence Polarization-Based Binding Displacement Kinase Assay
pH7.5±n/a
Temperature303.15±n/a K
Kd 7.6±.1 nM
Citation Lavogina, DLust, MViil, IKönig, NRaidaru, GRogozina, JEnkvist, EUri, ABossemeyer, D Structural analysis of ARC-type inhibitor (ARC-1034) binding to protein kinase A catalytic subunit and rational design of bisubstrate analogue inhibitors of basophilic protein kinases. J Med Chem52:308-21 (2009) 
 
cAMP-dependent protein kinase catalytic subunit alpha
Name:cAMP-dependent protein kinase catalytic subunit alpha
Type:Enzyme Catalytic Unit
Mol. Mass.:40579.18
Organism:Mus musculus (mouse)
Description:n/a
Residue:351
BDBM27225
BDBM27221
NameBDBM27225
Synonyms:(2R)-6-amino-2-(6-{[(2S,3S,4R,5R)-5-(6-amino-9H-purin-9-yl)-3,4-dihydroxyoxolan-2-yl]formamido}hexanamido)-N-(5-{[(1R)-4-carbamimidamido-1-{[(1R)-4-carbamimidamido-1-carbamoylbutyl]carbamoyl}butyl]carbamoyl}pentyl)hexanamide | ARC-1012, 15
TypeSmall organic molecule
Emp. Form.C40H70N18O9
Mol. Mass.947.099
SMILES[#7]-[#6]-[#6]-[#6]-[#6]-[#6@@H](-[#7]-[#6](=O)-[#6]-[#6]-[#6]-[#6]-[#6]-[#7]-[#6](=O)-[#6@H]-1-[#8]-[#6@H](-[#6@H](-[#8])-[#6@@H]-1-[#8])-n1cnc2c(-[#7])ncnc12)-[#6](=O)-[#7]-[#6]-[#6]-[#6]-[#6]-[#6]-[#6](=O)-[#7]-[#6@H](-[#6]-[#6]-[#6]\[#7]=[#6](\[#7])-[#7])-[#6](=O)-[#7]-[#6@H](-[#6]-[#6]-[#6]\[#7]=[#6](/[#7])-[#7])-[#6](-[#7])=O