Reaction Details
TargetCannabinoid receptor 1
LigandBDBM27342
Substrate/CompetitorBDBM21278
Meas. Tech.CB Receptor Binding Assay
pH7.4±n/a
Temperature303.15±n/a K
Ki 5.9±n/a nM
Citation Griffith, DAHadcock, JRBlack, SCIredale, PACarpino, PADaSilva-Jardine, PDay, RDiBrino, JDow, RLLandis, MSO'Connor, REScott, DO Discovery of 1-[9-(4-chlorophenyl)-8-(2-chlorophenyl)-9H-purin-6-yl]-4-ethylaminopiperidine-4-carboxylic acid amide hydrochloride (CP-945,598), a novel, potent, and selective cannabinoid type 1 receptor antagonist. J Med Chem52:234-7 (2009) 
 
Cannabinoid receptor 1
Name:Cannabinoid receptor 1
Type:G Protein-Coupled Receptor (GPCR)
Mol. Mass.:52856.55
Organism:Rattus norvegicus (rat)
Description:P20272
Residue:473
BDBM27342
BDBM21278
NameBDBM27342
Synonyms:9-(4-chlorophenyl)-8-(2,4-dichlorophenyl)-6-(4-methylpiperazin-1-yl)-9H-purine | Purine antagonist, 3f
TypeSmall organic molecule
Emp. Form.C22H19Cl3N6
Mol. Mass.473.785
SMILESCN1CCN(CC1)c1ncnc2n(c(nc12)-c1ccc(Cl)cc1Cl)-c1ccc(Cl)cc1