Reaction Details
TargetPoly [ADP-ribose] polymerase 1
LigandBDBM27500
Substrate/CompetitorBDBM27089
Meas. Tech.Scintillation Proximity Assay (SPA)
pH7.8±n/a
Temperature295.15±n/a K
IC50 85±22 nM
Citation Eltze, TBoer, RWagner, TWeinbrenner, SMcDonald, MCThiemermann, CBürkle, AKlein, T Imidazoquinolinone, imidazopyridine, and isoquinolindione derivatives as novel and potent inhibitors of the poly(ADP-ribose) polymerase (PARP): a comparison with standard PARP inhibitors. Mol Pharmacol74:1587-98 (2008) 
 
Poly [ADP-ribose] polymerase 1
Name:Poly [ADP-ribose] polymerase 1
Type:n/a
Mol. Mass.:113114.22
Organism:Homo sapiens (Human)
Description:P09874
Residue:1014
BDBM27500
BDBM27089
NameBDBM27500
Synonyms:5,6-dihydrophenanthridin-6-one 5H-Phenanthridin-6-one (PTD) CHEMBL45245 Phenanthridone | phenanthridin-6(5H)-one
TypeSmall organic molecule
Emp. Form.C13H9NO
Mol. Mass.195.2167
SMILESO=c1[nH]c2ccccc2c2ccccc12