Reaction Details
TargetPoly [ADP-ribose] polymerase 1
LigandBDBM27501
Substrate/CompetitorBDBM27089
Meas. Tech.Scintillation Proximity Assay (SPA)
pH7.8±n/a
Temperature295.15±n/a K
IC50 151±34 nM
Citation Eltze, TBoer, RWagner, TWeinbrenner, SMcDonald, MCThiemermann, CBürkle, AKlein, T Imidazoquinolinone, imidazopyridine, and isoquinolindione derivatives as novel and potent inhibitors of the poly(ADP-ribose) polymerase (PARP): a comparison with standard PARP inhibitors. Mol Pharmacol74:1587-98 (2008) 
 
Poly [ADP-ribose] polymerase 1
Name:Poly [ADP-ribose] polymerase 1
Type:n/a
Mol. Mass.:113114.22
Organism:Homo sapiens (Human)
Description:P09874
Residue:1014
BDBM27501
BDBM27089
NameBDBM27501
Synonyms:1,5-dihydroxyisoquinoline ISQ | isoquinoline-1,5-diol
TypeSmall organic molecule
Emp. Form.C9H7NO2
Mol. Mass.161.1574
SMILESOc1cccc2c1cc[nH]c2=O