Reaction Details
TargetPoly [ADP-ribose] polymerase 1
LigandBDBM27505
Substrate/CompetitorBDBM27089
Meas. Tech.Scintillation Proximity Assay (SPA)
pH7.8±n/a
Temperature295.15±n/a K
IC50 8511±2757 nM
Citation Eltze, TBoer, RWagner, TWeinbrenner, SMcDonald, MCThiemermann, CBürkle, AKlein, T Imidazoquinolinone, imidazopyridine, and isoquinolindione derivatives as novel and potent inhibitors of the poly(ADP-ribose) polymerase (PARP): a comparison with standard PARP inhibitors. Mol Pharmacol74:1587-98 (2008) 
 
Poly [ADP-ribose] polymerase 1
Name:Poly [ADP-ribose] polymerase 1
Type:n/a
Mol. Mass.:113114.22
Organism:Homo sapiens (Human)
Description:P09874
Residue:1014
BDBM27505
BDBM27089
NameBDBM27505
Synonyms:5-Iabp 6-amino-5-iodo-2H-chromen-2-one | INH2BP
TypeSmall organic molecule
Emp. Form.C9H6INO2
Mol. Mass.287.0539
SMILESNc1ccc2oc(=O)ccc2c1I