Reaction Details
TargetPoly [ADP-ribose] polymerase 1
LigandBDBM27507
Substrate/CompetitorBDBM27089
Meas. Tech.Scintillation Proximity Assay (SPA)
pH7.8±n/a
Temperature295.15±n/a K
IC50 50119±8432 nM
Citation Eltze, TBoer, RWagner, TWeinbrenner, SMcDonald, MCThiemermann, CBürkle, AKlein, T Imidazoquinolinone, imidazopyridine, and isoquinolindione derivatives as novel and potent inhibitors of the poly(ADP-ribose) polymerase (PARP): a comparison with standard PARP inhibitors. Mol Pharmacol74:1587-98 (2008) 
 
Poly [ADP-ribose] polymerase 1
Name:Poly [ADP-ribose] polymerase 1
Type:n/a
Mol. Mass.:113114.22
Organism:Homo sapiens (Human)
Description:P09874
Residue:1014
BDBM27507
BDBM27089
NameBDBM27507
Synonyms:3-Pyridinecarboxamide NAM nicotinamide | pyridine-3-carboxamide
Typen/a
Emp. Form.C6H6N2O
Mol. Mass.122.1246
SMILESNC(=O)c1cccnc1