Reaction Details
TargetPoly [ADP-ribose] polymerase 2
LigandBDBM27494
Substrate/CompetitorBDBM27089
Meas. Tech.Scintillation Proximity Assay (SPA)
pH7.8±n/a
Temperature295.15±n/a K
IC50 28±6 nM
Citation Eltze, TBoer, RWagner, TWeinbrenner, SMcDonald, MCThiemermann, CBürkle, AKlein, T Imidazoquinolinone, imidazopyridine, and isoquinolindione derivatives as novel and potent inhibitors of the poly(ADP-ribose) polymerase (PARP): a comparison with standard PARP inhibitors. Mol Pharmacol74:1587-98 (2008) 
 
Poly [ADP-ribose] polymerase 2
Name:Poly [ADP-ribose] polymerase 2
Type:n/a
Mol. Mass.:63409.97
Organism:Mus musculus (Mouse)
Description:Alexis Biochemicals, Cat. no. ALX-201-064-C020
Residue:559
BDBM27494
BDBM27089
NameBDBM27494
Synonyms:2-[4-(pyridin-2-yl)phenyl]-1,3-diazatricyclo[6.3.1.0^{4,12}]dodeca-2,4(12),5,7-tetraen-9-one BYK236864
TypeSmall organic molecule
Emp. Form.C21H15N3O
Mol. Mass.325.3633
SMILESO=C1CCn2c(nc3cccc1c23)-c1ccc(cc1)-c1ccccn1