Reaction Details
TargetPoly [ADP-ribose] polymerase 2
LigandBDBM27498
Substrate/CompetitorBDBM27089
Meas. Tech.Scintillation Proximity Assay (SPA)
pH7.8±n/a
Temperature295.15±n/a K
IC50 32±3 nM
Citation Eltze, TBoer, RWagner, TWeinbrenner, SMcDonald, MCThiemermann, CBürkle, AKlein, T Imidazoquinolinone, imidazopyridine, and isoquinolindione derivatives as novel and potent inhibitors of the poly(ADP-ribose) polymerase (PARP): a comparison with standard PARP inhibitors. Mol Pharmacol74:1587-98 (2008) 
 
Poly [ADP-ribose] polymerase 2
Name:Poly [ADP-ribose] polymerase 2
Type:n/a
Mol. Mass.:63409.97
Organism:Mus musculus (Mouse)
Description:Alexis Biochemicals, Cat. no. ALX-201-064-C020
Residue:559
BDBM27498
BDBM27089
NameBDBM27498
Synonyms:10-amino-3-azatricyclo[7.3.1.0^{5,13}]trideca-1(13),5,7,9,11-pentaene-2,4-dione 4-Amino-1,8-naphthalimide | CHEMBL338790
TypeSmall organic molecule
Emp. Form.C12H8N2O2
Mol. Mass.212.2041
SMILESNc1ccc2C(=O)NC(=O)c3cccc1c23