Reaction Details
TargetPoly [ADP-ribose] polymerase 1
LigandBDBM27543
Substrate/CompetitorBDBM27089
Meas. Tech.PARP-1 Enzyme Assay
pH7.4±n/a
Temperature295.15±n/a K
IC50 5±n/a nM
Citation Menear, KAAdcock, CBoulter, RCockcroft, XLCopsey, LCranston, ADillon, KJDrzewiecki, JGarman, SGomez, SJavaid, HKerrigan, FKnights, CLau, ALoh, VMMatthews, ITMoore, SO'Connor, MJSmith, GCMartin, NM 4-[3-(4-cyclopropanecarbonylpiperazine-1-carbonyl)-4-fluorobenzyl]-2H-phthalazin-1-one: a novel bioavailable inhibitor of poly(ADP-ribose) polymerase-1. J Med Chem51:6581-91 (2008) 
 
Poly [ADP-ribose] polymerase 1
Name:Poly [ADP-ribose] polymerase 1
Type:n/a
Mol. Mass.:113114.22
Organism:Homo sapiens (Human)
Description:P09874
Residue:1014
BDBM27543
BDBM27089
NameBDBM27543
Synonyms:4-{[4-fluoro-3-(piperazin-1-ylcarbonyl)phenyl]methyl}-1,2-dihydrophthalazin-1-one | Piperazine analogue, 24
TypeSmall organic molecule
Emp. Form.C20H19FN4O2
Mol. Mass.366.3889
SMILESFc1ccc(Cc2n[nH]c(=O)c3ccccc23)cc1C(=O)N1CCNCC1