Reaction Details
TargetPoly [ADP-ribose] polymerase 1
LigandBDBM27564
Substrate/CompetitorBDBM27089
Meas. Tech.PARP-1 Enzyme Assay
IC50 6±n/a nM
Citation Menear, KAAdcock, CBoulter, RCockcroft, XLCopsey, LCranston, ADillon, KJDrzewiecki, JGarman, SGomez, SJavaid, HKerrigan, FKnights, CLau, ALoh, VMMatthews, ITMoore, SO'Connor, MJSmith, GCMartin, NM 4-[3-(4-cyclopropanecarbonylpiperazine-1-carbonyl)-4-fluorobenzyl]-2H-phthalazin-1-one: a novel bioavailable inhibitor of poly(ADP-ribose) polymerase-1. J Med Chem51:6581-91 (2008) 
 
Poly [ADP-ribose] polymerase 1
Name:Poly [ADP-ribose] polymerase 1
Type:n/a
Mol. Mass.:113114.22
Organism:Homo sapiens (Human)
Description:P09874
Residue:1014
BDBM27564
BDBM27089
NameBDBM27564
Synonyms:4-({3-[(4-acetylpiperazin-1-yl)carbonyl]-4-fluorophenyl}methyl)-1,2-dihydrophthalazin-1-one | Acylpiperazine analogue, 45
TypeSmall organic molecule
Emp. Form.C22H21FN4O3
Mol. Mass.408.4255
SMILESCC(=O)N1CCN(CC1)C(=O)c1cc(Cc2n[nH]c(=O)c3ccccc23)ccc1F