Reaction Details
TargetPoly [ADP-ribose] polymerase 1
LigandBDBM27695
Substrate/CompetitorBDBM27683
Meas. Tech.PARP-1 Enzyme Inhibition Assay
pH8±n/a
Temperature296.15±n/a K
IC50 106±n/a nM
Citation Moree, WJGoldman, PDemaggio, AJChristenson, EHerendeen, DEksterowicz, JKesicki, EAMcElligott, DLBeaton, G Identification of ring-fused pyrazolo pyridin-2-ones as novel poly(ADP-ribose)polymerase-1 inhibitors. Bioorg Med Chem Lett18:5126-9 (2008) 
 
Poly [ADP-ribose] polymerase 1
Name:Poly [ADP-ribose] polymerase 1
Type:n/a
Mol. Mass.:113114.22
Organism:Homo sapiens (Human)
Description:P09874
Residue:1014
BDBM27695
BDBM27683
NameBDBM27695
Synonyms:5-methyl-3-phenyl-4,5,7-triazatricyclo[7.3.0.0^{2,6}]dodeca-1(9),2(6),3-trien-8-one | ring-fused pyrazolo pyridin-2-one, 22
TypeSmall organic molecule
Emp. Form.C16H15N3O
Mol. Mass.265.3098
SMILESCn1nc(-c2ccccc2)c2c3CCCc3c(=O)[nH]c12