Reaction Details
TargetPoly [ADP-ribose] polymerase 2
LigandBDBM27712
Substrate/CompetitorBDBM27683
Meas. Tech.PARP Enzyme Inhibition Assay
Temperature298.15±n/a K
IC50 660±n/a nM
Commentsextracted
Citation Ishida, JYamamoto, HKido, YKamijo, KMurano, KMiyake, HOhkubo, MKinoshita, TWarizaya, MIwashita, AMihara, KMatsuoka, NHattori, K Discovery of potent and selective PARP-1 and PARP-2 inhibitors: SBDD analysis via a combination of X-ray structural study and homology modeling. Bioorg Med Chem14:1378-90 (2006) 
 
Poly [ADP-ribose] polymerase 2
Name:Poly [ADP-ribose] polymerase 2
Type:n/a
Mol. Mass.:63409.97
Organism:Mus musculus (Mouse)
Description:Alexis Biochemicals, Cat. no. ALX-201-064-C020
Residue:559
BDBM27712
BDBM27683
NameBDBM27712
Synonyms:5-chloro-2-methyl-3,4-dihydroquinazolin-4-one quinazolinone analogue, 18
TypeSmall organic molecule
Emp. Form.C9H7ClN2O
Mol. Mass.194.618
SMILESCc1nc2cccc(Cl)c2c(=O)[nH]1