Reaction Details
TargetPoly [ADP-ribose] polymerase 2
LigandBDBM27717
Substrate/CompetitorBDBM27683
Meas. Tech.PARP Enzyme Inhibition Assay
Temperature298.15±n/a K
IC50 84±n/a nM
Commentsextracted
Citation Ishida, JYamamoto, HKido, YKamijo, KMurano, KMiyake, HOhkubo, MKinoshita, TWarizaya, MIwashita, AMihara, KMatsuoka, NHattori, K Discovery of potent and selective PARP-1 and PARP-2 inhibitors: SBDD analysis via a combination of X-ray structural study and homology modeling. Bioorg Med Chem14:1378-90 (2006) 
 
Poly [ADP-ribose] polymerase 2
Name:Poly [ADP-ribose] polymerase 2
Type:n/a
Mol. Mass.:63409.97
Organism:Mus musculus (Mouse)
Description:Alexis Biochemicals, Cat. no. ALX-201-064-C020
Residue:559
BDBM27717
BDBM27683
NameBDBM27717
Synonyms:4-{4-[4-(4-fluorophenyl)-1,2,3,6-tetrahydropyridin-1-yl]butyl}-1,2-dihydrophthalazin-1-one | phthalazinone analogue, 9b
TypeSmall organic molecule
Emp. Form.C23H24FN3O
Mol. Mass.377.4546
SMILESFc1ccc(cc1)C1=CCN(CCCCc2n[nH]c(=O)c3ccccc23)CC1