Reaction Details
TargetGlycogen phosphorylase, liver form
LigandBDBM27732
Substrate/CompetitorBDBM24362
Meas. Tech.Human Liver GPa Enzymatic Activity Assay
pH7.6±n/a
Temperature298.15±n/a K
IC50 28±16 nM
Citation Thomson, SABanker, PBickett, DMBoucheron, JACarter, HLClancy, DCCooper, JPDickerson, SHGarrido, DMNolte, RTPeat, AJSheckler, LRSparks, SMTavares, FXWang, LWang, TYWeiel, JE Anthranilimide based glycogen phosphorylase inhibitors for the treatment of type 2 diabetes. Part 3: X-ray crystallographic characterization, core and urea optimization and in vivo efficacy. Bioorg Med Chem Lett19:1177-82 (2009) 
 
Glycogen phosphorylase, liver form
Name:Glycogen phosphorylase, liver form
Type:Homodimer
Mol. Mass.:97153.98
Organism:Homo sapiens (Human)
Description:Dimers associate into a tetramer to form the enzymatically active phosphorylase A.
Residue:847
BDBM27732
BDBM24362
NameBDBM27732
Synonyms:(2S,3R)-3-(tert-butoxy)-2-{[4-(2-methoxyphenyl)-2-{[(2,4,6-trimethylphenyl)carbamoyl]amino}phenyl]formamido}butanoic acid | anthranilimide based compound, 8
TypeSmall organic molecule
Emp. Form.C32H39N3O6
Mol. Mass.561.6686
SMILESCOc1ccccc1-c1ccc(C(=O)N[C@@H]([C@@H](C)OC(C)(C)C)C(O)=O)c(NC(=O)Nc2c(C)cc(C)cc2C)c1