Reaction Details
TargetHistone deacetylase 1
LigandBDBM27761
Substrate/CompetitorBDBM25143
Meas. Tech.HDAC Activity Assay
pH8±n/a
Temperature310.15±n/a K
IC50 13±n/a nM
Citation Kattar, SDSurdi, LMZabierek, AMethot, JLMiddleton, REHughes, BSzewczak, AADahlberg, WKKral, AMOzerova, NFleming, JCWang, HSecrist, PHarsch, AHamill, JECruz, JCKenific, CMChenard, MMiller, TABerk, SCTempest, P Parallel medicinal chemistry approaches to selective HDAC1/HDAC2 inhibitor (SHI-1:2) optimization. Bioorg Med Chem Lett19:1168-72 (2009) 
 
Histone deacetylase 1
Name:Histone deacetylase 1
Type:Enzyme
Mol. Mass.:55090.27
Organism:Homo sapiens (Human)
Description:Q13547
Residue:482
BDBM27761
BDBM25143
NameBDBM27761
Synonyms:N-(2-hydroxy-5-phenylphenyl)-4-({[1-(pyridin-4-yl)ethyl]amino}methyl)benzamide | aminophenol analogue, 9
TypeSmall organic molecule
Emp. Form.C27H25N3O2
Mol. Mass.423.5063
SMILESCC(NCc1ccc(cc1)C(=O)Nc1cc(ccc1O)-c1ccccc1)c1ccncc1