Reaction Details
TargetHistone deacetylase 1
LigandBDBM27782
Substrate/CompetitorBDBM25143
Meas. Tech.HDAC Activity Assay
pH8±n/a
Temperature310.15±n/a K
IC50 8±n/a nM
Citation Kattar, SDSurdi, LMZabierek, AMethot, JLMiddleton, REHughes, BSzewczak, AADahlberg, WKKral, AMOzerova, NFleming, JCWang, HSecrist, PHarsch, AHamill, JECruz, JCKenific, CMChenard, MMiller, TABerk, SCTempest, P Parallel medicinal chemistry approaches to selective HDAC1/HDAC2 inhibitor (SHI-1:2) optimization. Bioorg Med Chem Lett19:1168-72 (2009) 
 
Histone deacetylase 1
Name:Histone deacetylase 1
Type:Enzyme
Mol. Mass.:55090.27
Organism:Homo sapiens (Human)
Description:Q13547
Residue:482
BDBM27782
BDBM25143
NameBDBM27782
Synonyms:N-(2-amino-5-phenylphenyl)-4-{1,8-diazaspiro[4.5]decan-8-ylcarbonyl}benzamide | terephthalamide, 30
TypeSmall organic molecule
Emp. Form.C28H30N4O2
Mol. Mass.454.5634
SMILESNc1ccc(cc1NC(=O)c1ccc(cc1)C(=O)N1CCC2(CCCN2)CC1)-c1ccccc1