Reaction Details
TargetBaculoviral IAP repeat-containing protein 2 [266-354]
LigandBDBM27918
Substrate/CompetitorBDBM17342
Meas. Tech.Fluorescence Polarization Affinity Measurements
Ki 129±n/a nM
Citation Cohen, FAlicke, BElliott, LOFlygare, JAGoncharov, TKeteltas, SFFranklin, MCFrankovitz, SStephan, JPTsui, VVucic, DWong, HFairbrother, WJ Orally bioavailable antagonists of inhibitor of apoptosis proteins based on an azabicyclooctane scaffold. J Med Chem52:1723-30 (2009) 
 
Baculoviral IAP repeat-containing protein 2 [266-354]
Name:Baculoviral IAP repeat-containing protein 2 [266-354]
Type:Chimeric Protein
Mol. Mass.:10496.31
Organism:Homo sapiens (Human)
Description:Q13490[266-354]
Residue:89
BDBM27918
BDBM17342
NameBDBM27918
Synonyms:(2S)-N-[(2S)-1-[(3aR,6S,6aS)-6-(2,2-diphenylacetamido)-octahydrocyclopenta[b]pyrrol-1-yl]-3,3-dimethyl-1-oxobutan-2-yl]-2-(methylamino)propanamide | Azabicyclooctane scaffold, 14a
TypeSmall organic molecule
Emp. Form.C31H42N4O3
Mol. Mass.518.6902
SMILES[H][C@]12CC[C@H](NC(=O)C(c3ccccc3)c3ccccc3)[C@@]1([H])N(CC2)C(=O)[C@@H](NC(=O)[C@H](C)NC)C(C)(C)C