Reaction Details
TargetOrotidine 5'-phosphate decarboxylase
LigandBDBM21339
Substrate/CompetitorBDBM21336
Meas. Tech.Enzyme Inhibition Assay
pH7.5±n/a
Temperature328.15±n/a K
Ki 134000±5000 nM
Citation Bello, AMKonforte, DPoduch, EFurlonger, CWei, LLiu, YLewis, MPai, EFPaige, CJKotra, LP Structure-activity relationships of orotidine-5'-monophosphate decarboxylase inhibitors as anticancer agents. J Med Chem52:1648-58 (2009) 
 
Orotidine 5'-phosphate decarboxylase
Name:Orotidine 5'-phosphate decarboxylase
Type:Enzyme
Mol. Mass.:24909.45
Organism:Methanobacterium thermoautotrophicum
Description:n/a
Residue:228
BDBM21339
BDBM21336
NameBDBM21339
Synonyms:6-Methyl-uridine 5-O-Monophosphate JMC521648 Compound 38 | {[(2R,3S,4R,5R)-3,4-dihydroxy-5-(6-methyl-2,4-dioxo-1,2,3,4-tetrahydropyrimidin-1-yl)oxolan-2-yl]methoxy}phosphonic acid
TypeSmall organic molecule
Emp. Form.C10H15N2O9P
Mol. Mass.338.2079
SMILESCc1cc(=O)[nH]c(=O)n1[C@@H]1O[C@H](COP(O)(O)=O)[C@@H](O)[C@H]1O