Reaction Details
TargetUridine 5'-monophosphate synthase
LigandBDBM27946
Substrate/CompetitorBDBM21336
Meas. Tech.Enzyme Inhibition Assay
pH7.5±n/a
Temperature310.15±n/a K
Ki 350±10 nM
Citation Bello, AMKonforte, DPoduch, EFurlonger, CWei, LLiu, YLewis, MPai, EFPaige, CJKotra, LP Structure-activity relationships of orotidine-5'-monophosphate decarboxylase inhibitors as anticancer agents. J Med Chem52:1648-58 (2009) 
 
Uridine 5'-monophosphate synthase
Name:Uridine 5'-monophosphate synthase
Type:Enzyme
Mol. Mass.:52224.99
Organism:Homo sapiens (Human)
Description:P11172
Residue:480
BDBM27946
BDBM21336
NameBDBM27946
Synonyms:uridine derivative, 43 | {[(2R,3S,4R,5R)-5-(6-ethyl-5-fluoro-2,4-dioxo-1,2,3,4-tetrahydropyrimidin-1-yl)-3,4-dihydroxyoxolan-2-yl]methoxy}phosphonic acid
Typen/a
Emp. Form.C11H16FN2O9P
Mol. Mass.370.2249
SMILESCCc1c(F)c(=O)[nH]c(=O)n1[C@@H]1O[C@H](COP(O)(O)=O)[C@@H](O)[C@H]1O