Reaction Details
TargetDiacylglycerol O-acyltransferase 1
LigandBDBM27951
Substrate/CompetitorBDBM27948
Meas. Tech.DGAT Enzyme Inhibition Assay
pH7.4±n/a
Temperature295.15±n/a K
IC50 28±n/a nM
Citation Birch, AMBirtles, SBuckett, LKKemmitt, PDSmith, GJSmith, TJTurnbull, AVWang, SJ Discovery of a potent, selective, and orally efficacious pyrimidinooxazinyl bicyclooctaneacetic acid diacylglycerol acyltransferase-1 inhibitor. J Med Chem52:1558-68 (2009) 
 
Diacylglycerol O-acyltransferase 1
Name:Diacylglycerol O-acyltransferase 1
Type:Protein
Mol. Mass.:55297.82
Organism:Homo sapiens (Human)
Description:O75907
Residue:488
BDBM27951
BDBM27948
NameBDBM27951
Synonyms:2-[4-(4-{4-amino-7,7-dimethyl-7H-pyrimido[4,5-b][1,4]oxazin-6-yl}phenyl)bicyclo[2.2.2]octan-1-yl]propanoic acid | bicyclo[2.2.2]octane-pyrimido[4,5-b][1,4]oxazine deriv., 5
TypeSmall organic molecule
Emp. Form.C25H30N4O3
Mol. Mass.434.5307
SMILESCC(C(O)=O)C12CCC(CC1)(CC2)c1ccc(cc1)C1=Nc2c(N)ncnc2OC1(C)C