Reaction Details
TargetExtracellular calcium-sensing receptor
LigandBDBM27985
Substrate/CompetitorBDBM10852
Meas. Tech.Calcium-Sensing Receptor Antagonist Fluorescence Assay
pH7.5±n/a
Temperature310.15±n/a K
IC50 70±n/a nM
Citation Yang, WRuan, ZWang, YVan Kirk, KMa, ZArey, BJCooper, CBSeethala, RFeyen, JHDickson, JK Discovery and Structure-Activity Relationships of Trisubstituted Pyrimidines/Pyridines as Novel Calcium-Sensing Receptor Antagonists. J Med Chem52:1204-8 (2009) 
 
Extracellular calcium-sensing receptor
Name:Extracellular calcium-sensing receptor
Type:Protein
Mol. Mass.:120663.13
Organism:Homo sapiens (Human)
Description:P41180
Residue:1078
BDBM27985
BDBM10852
NameBDBM27985
Synonyms:2-{[(3-chlorophenyl)methyl]amino}-N-(2-phenoxyethyl)-4-(3,4,5-trimethoxyphenyl)pyrimidine-5-carboxamide | trisubstituted pyrimidine analogue, 6f
TypeSmall organic molecule
Emp. Form.C29H29ClN4O5
Mol. Mass.549.017
SMILESCOc1cc(cc(OC)c1OC)-c1nc(NCc2cccc(Cl)c2)ncc1C(=O)NCCOc1ccccc1