Reaction Details
TargetExtracellular calcium-sensing receptor
LigandBDBM27987
Substrate/CompetitorBDBM10852
Meas. Tech.Calcium-Sensing Receptor Antagonist Fluorescence Assay
pH7.5±n/a
Temperature310.15±n/a K
IC50 340±n/a nM
Citation Yang, WRuan, ZWang, YVan Kirk, KMa, ZArey, BJCooper, CBSeethala, RFeyen, JHDickson, JK Discovery and Structure-Activity Relationships of Trisubstituted Pyrimidines/Pyridines as Novel Calcium-Sensing Receptor Antagonists. J Med Chem52:1204-8 (2009) 
 
Extracellular calcium-sensing receptor
Name:Extracellular calcium-sensing receptor
Type:Protein
Mol. Mass.:120663.13
Organism:Homo sapiens (Human)
Description:P41180
Residue:1078
BDBM27987
BDBM10852
NameBDBM27987
Synonyms:2-{[(3-methoxyphenyl)methyl]amino}-N-(2-phenoxyethyl)-4-(3,4,5-trimethoxyphenyl)pyrimidine-5-carboxamide | trisubstituted pyrimidine analogue, 6h
TypeSmall organic molecule
Emp. Form.C30H32N4O6
Mol. Mass.544.5983
SMILESCOc1cccc(CNc2ncc(C(=O)NCCOc3ccccc3)c(n2)-c2cc(OC)c(OC)c(OC)c2)c1