Reaction Details
TargetExtracellular calcium-sensing receptor
LigandBDBM27990
Substrate/CompetitorBDBM10852
Meas. Tech.Calcium-Sensing Receptor Antagonist Fluorescence Assay
pH7.5±n/a
Temperature310.15±n/a K
IC50>30000±n/a nM
Citation Yang, WRuan, ZWang, YVan Kirk, KMa, ZArey, BJCooper, CBSeethala, RFeyen, JHDickson, JK Discovery and Structure-Activity Relationships of Trisubstituted Pyrimidines/Pyridines as Novel Calcium-Sensing Receptor Antagonists. J Med Chem52:1204-8 (2009) 
 
Extracellular calcium-sensing receptor
Name:Extracellular calcium-sensing receptor
Type:Protein
Mol. Mass.:120663.13
Organism:Homo sapiens (Human)
Description:P41180
Residue:1078
BDBM27990
BDBM10852
NameBDBM27990
Synonyms:N-(2-phenoxyethyl)-2-[(pyridin-3-ylmethyl)amino]-4-(3,4,5-trimethoxyphenyl)pyrimidine-5-carboxamide | trisubstituted pyrimidine analogue, 6k
TypeSmall organic molecule
Emp. Form.C28H29N5O5
Mol. Mass.515.5604
SMILESCOc1cc(cc(OC)c1OC)-c1nc(NCc2cccnc2)ncc1C(=O)NCCOc1ccccc1