Reaction Details
TargetExtracellular calcium-sensing receptor
LigandBDBM28004
Substrate/CompetitorBDBM10852
Meas. Tech.Calcium-Sensing Receptor Antagonist Fluorescence Assay
pH7.5±n/a
Temperature310.15±n/a K
IC50 1800±n/a nM
Citation Yang, WRuan, ZWang, YVan Kirk, KMa, ZArey, BJCooper, CBSeethala, RFeyen, JHDickson, JK Discovery and Structure-Activity Relationships of Trisubstituted Pyrimidines/Pyridines as Novel Calcium-Sensing Receptor Antagonists. J Med Chem52:1204-8 (2009) 
 
Extracellular calcium-sensing receptor
Name:Extracellular calcium-sensing receptor
Type:Protein
Mol. Mass.:120663.13
Organism:Homo sapiens (Human)
Description:P41180
Residue:1078
BDBM28004
BDBM10852
NameBDBM28004
Synonyms:2-[benzyl(ethyl)amino]-N-(4-phenylbutyl)-4-(3,4,5-trimethoxyphenyl)pyrimidine-5-carboxamide | trisubstituted pyrimidine analogue, 11e
TypeSmall organic molecule
Emp. Form.C33H38N4O4
Mol. Mass.554.6792
SMILESCCN(Cc1ccccc1)c1ncc(C(=O)NCCCCc2ccccc2)c(n1)-c1cc(OC)c(OC)c(OC)c1