Reaction Details
TargetExtracellular calcium-sensing receptor
LigandBDBM28009
Substrate/CompetitorBDBM10852
Meas. Tech.Calcium-Sensing Receptor Antagonist Fluorescence Assay
IC50 6900±n/a nM
Citation Yang, WRuan, ZWang, YVan Kirk, KMa, ZArey, BJCooper, CBSeethala, RFeyen, JHDickson, JK Discovery and Structure-Activity Relationships of Trisubstituted Pyrimidines/Pyridines as Novel Calcium-Sensing Receptor Antagonists. J Med Chem52:1204-8 (2009) 
 
Extracellular calcium-sensing receptor
Name:Extracellular calcium-sensing receptor
Type:Protein
Mol. Mass.:120663.13
Organism:Homo sapiens (Human)
Description:P41180
Residue:1078
BDBM28009
BDBM10852
NameBDBM28009
Synonyms:2-[benzyl(methyl)amino]-4-(3,4-dimethoxyphenyl)-N-(2-phenoxyethyl)pyrimidine-5-carboxamide | trisubstituted pyrimidine analogue, 11j
TypeSmall organic molecule
Emp. Form.C29H30N4O4
Mol. Mass.498.5729
SMILESCOc1ccc(cc1OC)-c1nc(ncc1C(=O)NCCOc1ccccc1)N(C)Cc1ccccc1