Reaction Details
TargetOxysterols receptor LXR-beta
LigandBDBM28138
Substrate/CompetitorBDBM19993
Meas. Tech.Radioligand Binding Assay and Luciferase Transcriptional Reporter Gene Assay
IC50 21±n/a nM
EC50 430±n/a nM
Citation Ratni, HBlum-Kaelin, DDehmlow, HHartman, PJablonski, PMasciadri, RMaugeais, CPatiny-Adam, APanday, NWright, M Discovery of tetrahydro-cyclopenta[b]indole as selective LXRs modulator. Bioorg Med Chem Lett19:1654-7 (2009) 
 
Oxysterols receptor LXR-beta
Name:Oxysterols receptor LXR-beta
Type:Enzyme Catalytic Domain
Mol. Mass.:50978.79
Organism:Homo sapiens (Human)
Description:P55055
Residue:460
BDBM28138
BDBM19993
NameBDBM28138
Synonyms:methyl (2S)-2-[(2R)-6-chloro-2,3,4,9-tetrahydro-1H-carbazol-2-yl]-2-fluoro-2-[(3-fluorobenzene)sulfonyl]acetate | tetrahydro-carbazole, (+/-)18
TypeSmall organic molecule
Emp. Form.C21H18ClF2NO4S
Mol. Mass.453.887
SMILES[H][C@]1(CCc2c(C1)[nH]c1ccc(Cl)cc21)[C@@](F)(C(=O)OC)S(=O)(=O)c1cccc(F)c1