Reaction Details
TargetOxysterols receptor LXR-beta
LigandBDBM28154
Substrate/CompetitorBDBM19993
Meas. Tech.Radioligand Binding Assay and Luciferase Transcriptional Reporter Gene Assay
IC50 13±n/a nM
EC50 120±n/a nM
Citation Ratni, HBlum-Kaelin, DDehmlow, HHartman, PJablonski, PMasciadri, RMaugeais, CPatiny-Adam, APanday, NWright, M Discovery of tetrahydro-cyclopenta[b]indole as selective LXRs modulator. Bioorg Med Chem Lett19:1654-7 (2009) 
 
Oxysterols receptor LXR-beta
Name:Oxysterols receptor LXR-beta
Type:Enzyme Catalytic Domain
Mol. Mass.:50978.79
Organism:Homo sapiens (Human)
Description:P55055
Residue:460
BDBM28154
BDBM19993
NameBDBM28154
Synonyms:5-[(S)-(benzenesulfonyl)[(2R)-7-chloro-1H,2H,3H,4H-cyclopenta[b]indol-2-yl]fluoromethyl]-N,N-dimethyl-1,2,4-oxadiazol-3-amine | tetrahydro-cyclopenta[b]indole, (+/-)28c
TypeSmall organic molecule
Emp. Form.C22H20ClFN4O3S
Mol. Mass.474.936
SMILES[H][C@@]1(Cc2[nH]c3ccc(Cl)cc3c2C1)[C@@](F)(c1nc(no1)N(C)C)S(=O)(=O)c1ccccc1