Reaction Details
Target11-beta-hydroxysteroid dehydrogenase 1
LigandBDBM28367
Substrate/CompetitorBDBM13739
Meas. Tech.11beta-HSD1 SPA Assay
pH7.5±n/a
Temperature295.15±n/a K
IC50 0.88±n/a nM
Citation Rew, YMcMinn, DLWang, ZHe, XHungate, RWJaen, JCSudom, ASun, DTu, HUrsu, SVillemure, EWalker, NPYan, XYe, QPowers, JP Discovery and optimization of piperidyl benzamide derivatives as a novel class of 11beta-HSD1 inhibitors. Bioorg Med Chem Lett19:1797-801 (2009) 
 
11-beta-hydroxysteroid dehydrogenase 1
Name:11-beta-hydroxysteroid dehydrogenase 1
Type:Enzyme
Mol. Mass.:32409.16
Organism:Homo sapiens (Human)
Description:P28845
Residue:292
BDBM28367
BDBM13739
NameBDBM28367
Synonyms:N-[4-(2-cyano-2,2-dimethylethyl)cyclohexyl]-N-cyclopropyl-4-[(2S)-1,1,1-trifluoro-2-hydroxypropan-2-yl]benzamide | cyclohexyl benzamide derivative, 6
TypeSmall organic molecule
Emp. Form.C24H31F3N2O2
Mol. Mass.436.5103
SMILESCC(C)(C[C@H]1CC[C@@H](CC1)N(C1CC1)C(=O)c1ccc(cc1)[C@](C)(O)C(F)(F)F)C#N