Reaction Details
TargetAdenosine deaminase
LigandBDBM28393
Substrate/CompetitorBDBM14487
Meas. Tech.ADA Enzyme Inhibition Assay
pH7.2±n/a
Temperature303.15±n/a K
Ki 1140±100 nM
Citation La Motta, CSartini, SMugnaini, LSalerno, SSimorini, FTaliani, SMarini, AMDa Settimo, FLavecchia, ANovellino, EAntonioli, LFornai, MBlandizzi, CDel Tacca, M Exploiting the pyrazolo[3,4-d]pyrimidin-4-one ring system as a useful template to obtain potent adenosine deaminase inhibitors. J Med Chem52:1681-92 (2009) 
 
Adenosine deaminase
Name:Adenosine deaminase
Type:Enzyme
Mol. Mass.:40910.44
Organism:Bos taurus (bovine)
Description:n/a
Residue:363
BDBM28393
BDBM14487
NameBDBM28393
Synonyms:(+)-EHNA CHEMBL296435
TypeSmall organic molecule
Emp. Form.C14H23N5O
Mol. Mass.277.3653
SMILESCCCCCC[C@H]([C@H](C)O)n1cnc2c(N)ncnc12