Reaction Details
TargetMacrophage metalloelastase
LigandBDBM28473
Substrate/CompetitorBDBM28488
Meas. Tech.MMP Inhibition Assay
pH7.5±n/a
Temperature295.15±n/a K
IC50 2.1±n/a nM
Citation Li, WLi, JWu, YWu, JHotchandani, RCunningham, KMcFadyen, IBard, JMorgan, PSchlerman, FXu, XTam, SGoldman, SJWilliams, CSypek, JMansour, TS A selective matrix metalloprotease 12 inhibitor for potential treatment of chronic obstructive pulmonary disease (COPD): discovery of (S)-2-(8-(methoxycarbonylamino)dibenzo[b,d]furan-3-sulfonamido)-3-methylbutanoic acid (MMP408). J Med Chem52:1799-802 (2009) 
 
Macrophage metalloelastase
Name:Macrophage metalloelastase
Type:Enzyme
Mol. Mass.:54012.99
Organism:Homo sapiens (Human)
Description:P39900
Residue:470
BDBM28473
BDBM28488
NameBDBM28473
Synonyms:(2S)-2-[(12-{[(2-fluoroethoxy)carbonyl]amino}-8-oxatricyclo[7.4.0.0^{2,7}]trideca-1(9),2(7),3,5,10,12-hexaene-5-)sulfonamido]-3-methylbutanoic acid | dibenzofuran (DBF) scaffold, (S)-18
TypeSmall organic molecule
Emp. Form.C20H21FN2O7S
Mol. Mass.452.453
SMILESCC(C)[C@H](NS(=O)(=O)c1ccc2c(c1)oc1ccc(NC(=O)OCCF)cc21)C(O)=O