Reaction Details
TargetCollagenase 3
LigandBDBM28479
Substrate/CompetitorBDBM28488
Meas. Tech.MMP Inhibition Assay
IC50 2.1±n/a nM
Citation Li, WLi, JWu, YWu, JHotchandani, RCunningham, KMcFadyen, IBard, JMorgan, PSchlerman, FXu, XTam, SGoldman, SJWilliams, CSypek, JMansour, TS A selective matrix metalloprotease 12 inhibitor for potential treatment of chronic obstructive pulmonary disease (COPD): discovery of (S)-2-(8-(methoxycarbonylamino)dibenzo[b,d]furan-3-sulfonamido)-3-methylbutanoic acid (MMP408). J Med Chem52:1799-802 (2009) 
 
Collagenase 3
Name:Collagenase 3
Type:Enzyme
Mol. Mass.:53808.06
Organism:Homo sapiens (Human)
Description:P45452
Residue:471
BDBM28479
BDBM28488
NameBDBM28479
Synonyms:(2S)-2-({12-[(cyclopentylcarbamoyl)amino]-8-oxatricyclo[7.4.0.0^{2,7}]trideca-1(9),2(7),3,5,10,12-hexaene-5-}sulfonamido)-3-methylbutanoic acid | dibenzofuran (DBF) scaffold, (S)-24
TypeSmall organic molecule
Emp. Form.C23H27N3O6S
Mol. Mass.473.542
SMILESCC(C)[C@H](NS(=O)(=O)c1ccc2c(c1)oc1ccc(NC(=O)NC3CCCC3)cc21)C(O)=O