Reaction Details
TargetBile acid receptor
LigandBDBM28538
Substrate/CompetitorBDBM10852
Meas. Tech.FXR Co-transfection Assay
pH7±n/a
Temperature295.15±n/a K
EC50 12±n/a nM
Comments144% efficacy.
Citation Flatt, BMartin, RWang, TLMahaney, PMurphy, BGu, XHFoster, PLi, JPircher, PPetrowski, MSchulman, IWestin, SWrobel, JYan, GBischoff, EDaige, CMohan, R Discovery of XL335 (WAY-362450), a Highly Potent, Selective, and Orally Active Agonist of the Farnesoid X Receptor (FXR). J Med Chem52:904-7 (2009) 
 
Bile acid receptor
Name:Bile acid receptor
Type:Nuclear Receptor
Mol. Mass.:55916.24
Organism:Homo sapiens (Human)
Description:Q96RI1
Residue:486
BDBM28538
BDBM10852
NameBDBM28538
Synonyms:Azepino[4,5-b]indole, 6i ethyl 3-[(3,4-difluorophenyl)carbonyl]-1,1-dimethyl-1H,2H,3H,6H-azepino[4,5-b]indole-5-carboxylate
TypeSmall organic molecule
Emp. Form.C24H22F2N2O3
Mol. Mass.424.4399
SMILESCCOC(=O)C1=CN(CC(C)(C)c2c1[nH]c1ccccc21)C(=O)c1ccc(F)c(F)c1