Reaction Details
Target5-hydroxytryptamine receptor 6
LigandBDBM28591
Substrate/CompetitorBDBM21342
Meas. Tech.Filtration Binding Assay
pH7.5±n/a
Temperature295.15±n/a K
Ki 126±n/a nM
Citation Singer, JMWilson, MWJohnson, PDGraham, SRCooke, LWRoof, RLBoxer, PAGold, LHMeltzer, LTJanssen, ARoush, NCampbell, JESu, TZHurst, SIStoner, CLSchwarz, JB Synthesis and SAR of tolylamine 5-HT6 antagonists. Bioorg Med Chem Lett19:2409-12 (2009) 
 
5-hydroxytryptamine receptor 6
Name:5-hydroxytryptamine receptor 6
Type:G Protein-Coupled Receptor (GPCR)
Mol. Mass.:46968.43
Organism:Homo sapiens (Human)
Description:P50406
Residue:440
BDBM28591
BDBM21342
NameBDBM28591
Synonyms:1-[2-methyl-3-(pyridin-3-ylmethoxy)phenyl]piperazine | tolylpiperazine, 5g
TypeSmall organic molecule
Emp. Form.C17H21N3O
Mol. Mass.283.3681
SMILESCc1c(OCc2cccnc2)cccc1N1CCNCC1