Reaction Details
Target5-hydroxytryptamine receptor 6
LigandBDBM28606
Substrate/CompetitorBDBM21342
Meas. Tech.Filtration Binding Assay
pH7.5±n/a
Temperature295.15±n/a K
Ki>440±n/a nM
Citation Singer, JMWilson, MWJohnson, PDGraham, SRCooke, LWRoof, RLBoxer, PAGold, LHMeltzer, LTJanssen, ARoush, NCampbell, JESu, TZHurst, SIStoner, CLSchwarz, JB Synthesis and SAR of tolylamine 5-HT6 antagonists. Bioorg Med Chem Lett19:2409-12 (2009) 
 
5-hydroxytryptamine receptor 6
Name:5-hydroxytryptamine receptor 6
Type:G Protein-Coupled Receptor (GPCR)
Mol. Mass.:46968.43
Organism:Homo sapiens (Human)
Description:P50406
Residue:440
BDBM28606
BDBM21342
NameBDBM28606
Synonyms:4-{3-[(3-chlorophenyl)methoxy]-2-methylphenyl}piperidin-4-ol | tolylpiperidine, 9p
TypeSmall organic molecule
Emp. Form.C19H22ClNO2
Mol. Mass.331.836
SMILESCc1c(OCc2cccc(Cl)c2)cccc1C1(O)CCNCC1