Reaction Details
Target5-hydroxytryptamine receptor 6
LigandBDBM28618
Substrate/CompetitorBDBM21342
Meas. Tech.Filtration Binding Assay
Temperature298.15±n/a K
Ki 208±n/a nM
Commentsextracted
Citation Singer, JMWilson, MWJohnson, PDGraham, SRCooke, LWRoof, RLBoxer, PAGold, LHMeltzer, LTJanssen, ARoush, NCampbell, JESu, TZHurst, SIStoner, CLSchwarz, JB Synthesis and SAR of tolylamine 5-HT6 antagonists. Bioorg Med Chem Lett19:2409-12 (2009) 
 
5-hydroxytryptamine receptor 6
Name:5-hydroxytryptamine receptor 6
Type:G Protein-Coupled Receptor (GPCR)
Mol. Mass.:46968.43
Organism:Homo sapiens (Human)
Description:P50406
Residue:440
BDBM28618
BDBM21342
NameBDBM28618
Synonyms:2-[(1R)-1-(3-chlorophenyl)ethoxy]-3-methyl-4-(piperidin-4-yl)pyridine | pyridylpiperidine, 13n
TypeSmall organic molecule
Emp. Form.C19H23ClN2O
Mol. Mass.330.852
SMILESC[C@@H](Oc1nccc(C2CCNCC2)c1C)c1cccc(Cl)c1