Reaction Details
Target5-hydroxytryptamine receptor 6
LigandBDBM28620
Substrate/CompetitorBDBM21342
Meas. Tech.Filtration Binding Assay
Temperature298.15±n/a K
Ki 2.4±n/a nM
Commentsextracted
Citation Singer, JMWilson, MWJohnson, PDGraham, SRCooke, LWRoof, RLBoxer, PAGold, LHMeltzer, LTJanssen, ARoush, NCampbell, JESu, TZHurst, SIStoner, CLSchwarz, JB Synthesis and SAR of tolylamine 5-HT6 antagonists. Bioorg Med Chem Lett19:2409-12 (2009) 
 
5-hydroxytryptamine receptor 6
Name:5-hydroxytryptamine receptor 6
Type:G Protein-Coupled Receptor (GPCR)
Mol. Mass.:46968.43
Organism:Homo sapiens (Human)
Description:P50406
Residue:440
BDBM28620
BDBM21342
NameBDBM28620
Synonyms:2-[1-(3-chlorophenyl)-2,2,2-trifluoroethoxy]-3-methyl-4-(piperidin-4-yl)pyridine | pyridylpiperidine, 13q
TypeSmall organic molecule
Emp. Form.C19H20ClF3N2O
Mol. Mass.384.823
SMILESCc1c(OC(c2cccc(Cl)c2)C(F)(F)F)nccc1C1CCNCC1