Reaction Details
Target5-hydroxytryptamine receptor 6
LigandBDBM28632
Substrate/CompetitorBDBM21342
Meas. Tech.Filtration Binding Assay
Temperature298.15±n/a K
Ki 15.1±n/a nM
Commentsextracted
Citation Singer, JMWilson, MWJohnson, PDGraham, SRCooke, LWRoof, RLBoxer, PAGold, LHMeltzer, LTJanssen, ARoush, NCampbell, JESu, TZHurst, SIStoner, CLSchwarz, JB Synthesis and SAR of tolylamine 5-HT6 antagonists. Bioorg Med Chem Lett19:2409-12 (2009) 
 
5-hydroxytryptamine receptor 6
Name:5-hydroxytryptamine receptor 6
Type:G Protein-Coupled Receptor (GPCR)
Mol. Mass.:46968.43
Organism:Homo sapiens (Human)
Description:P50406
Residue:440
BDBM28632
BDBM21342
NameBDBM28632
Synonyms:2-methyl-3-(piperidin-4-yl)phenyl 3-methylbenzene-1-sulfonate | tolylpiperidine, 18h
TypeSmall organic molecule
Emp. Form.C19H23NO3S
Mol. Mass.345.456
SMILESCc1cccc(c1)S(=O)(=O)Oc1cccc(C2CCNCC2)c1C